command failed with exit code 1 cordova

command failed with exit code 1 cordova

This can be done for instance with a property. Priority: Major … ERROR building one of the platforms: Error: cmd: Command failed with exit code 1. If anyone is in there config as regular as me. React Native Overview. Compiler error: linker command failed with exit code 1 A link command failed with exit code 1 (use – V to see invocation) was reported when compiling the project today. cordova build Command failed “gradle: Command failed with exit code EACCES” OpenResty Best Practices-Expression OpenResty Best Practices-Lua Basic Data Type I installed a git application to my win7 x64 env. Are you using any 3rd party plugins? January 30, 2018 Nodejs Leave a comment. Here my variables : Key CYPRESS_RECORD_KEY Value ea2ec1ea-edbe-40f0-9300-72 DEBUG netlify-plugin-cypress,netlify-plugin-cypress:verbose NODE_VERSION 12.16.2 YARN_VERSION 1.22.4 … But this time this would not fix it. Docker command failed with exit code 1. visual studio 2019 version 16.7 windows 10.0. 0 ⋮ Vote. Hello Gediminas, Looking at the stack trace you provided, it seems that you're trying to build a project with the PhoneGap CLI.However, if you have created the project with AppBuilder you will not be able to build it with the PhoneGap Command-Line interface out-of-the-box. cordova build Command failed “gradle: Command failed with exit code EACCES” OpenResty Best Practices-Expression OpenResty Best Practices-Lua Basic Data Type I filed it as a GitHub issue on cordova-useragent repository, where I thought it should be kept in. I was building my android project: But I encountered the following unusual error at the end of the build: What was unusual was that the production APK build was successful, but there was an error that occurred nonetheless. clang: error: linker command failed with exit code 1 while compiling mex in MATLAB2015b on mac os X 10.13.4. Remove and re-add the cordova plugin using the following terminal commands: If the plugin couldn’t be successfully removed, ignore the error. Problem lies in required version not installed. I have installed the facebook plugin then i was getting errors in connectPlugin.java file then i imported the facebook SDK library in my project. ionic:utils-process onBeforeExit handler: 'process.exit' received +0ms ionic:utils-process onBeforeExit handler: running 2 functions +0ms ionic:utils-process processExit: exiting (exit code: 1) +31ms Ionic/Phonegap/Cordova Overview. Delete platforms/android folder and try to rebuild. Delete all the apk files from platfroms >> android >> build >> generated >> outputs >> apk and run command cordova run android. Learn how your comment data is processed. Yesterday i was build my cordova app via cordova build android --release. Installing "cordova-plugin-appcenter-shared" for ios Failed to install 'cordova-plugin-appcenter-shared': Error: pod: Command failed with exit code 1 In 0.3.0 , we dropped iOS 8 support. If you are using custom namespaces in your code, make sure you set up the namespaces properly. [SOLVED] cordova build Command failed with exit code EACCES | Node.js Knowledge Base The issue with this is that the 4.5.5 version of cordova-ios targeted iOS 9.0 by default, but used iOS 8.0 in the podfile. Hi, I'm italian and this is my first time on the forum. Thanks a lot ! Is this possible? Delete. The actual fix for this problem is to update the plugin with the changes I described, and actually implemented by GitHub user @aaronneon2. Posted by: admin Flutter Integration overview. Log In. i have a cordova project in my Windows 7 x64 machine. I’m new on cordova, so if my question is not relevant, forgive me. One thought on “ Linker command failed with exit code 1 ” Justin Kiffiak says: Files\Microsoft Shared\Windows Live;%C_EM64T_REDIST11%bin\Intel64;%SystemRoot%\system32;%SystemRoot%;%SystemRoot%\System32\Wbem;%SYSTEMROOT%\System32\WindowsPowerShell\v1.0\;C:\Program Your email address will not be published. Cordova Process finished with exit code-1 This article is an English version of an article which is originally in the Chinese language on aliyun.com and is provided for information purposes only. I am building a phone gap (Cordova 3.5) app for android and trying to implement facebook login. a GitHub issue on cordova-useragent repository. Since there are never more than 10’000 properties for rent, it’s no problem to load em all into memory. The other day while I was hacking away on this Ionic-Angular project for work. I use Ubuntu 18.04, last version of Cordova. I have had this problem several times and it can be usually resolved with a clean and rebuild as answered by many before me. If you want to review or analyze how I debugged this problem, checkout the issue I filed on GitHub! File ‘C:\Users\Colin\etc’ specified for property ‘signingConfig.storeFile’ is not a file. Pastebin is a website where you can store text online for a set period of time. With WP_DEBUG_LOG set to true, no debug output shows in debug.log, why? orms\android\build.xml,-Dout.dir=ant-build,-Dgen.absolute.dir=ant-gen Save my name, email, and website in this browser for the next time I comment. I could not build in end up because i had a space in my id. Show comments 1. They can be provided to the cordova-cli with a '--' separator that stops the command parsing within the cordova-lib module and passes through rest of the options for platforms to parse. compiler error o utput for details. Examples This example demonstrates how cordova-cli can be used to create a project with the camera plugin and run it for android platform. Details. XML Word Printable JSON. Save my name, email, and website in this browser for the next time I comment. Vote. In the future, promise rejections that are not handled will terminate the Node.js process with a non-zero exit code. Ubuntu Cordova command failed with exit code 1 on cordova build ubuntu - 5.4.0. One is the quick workaround, while the other one is the actual fix. error occurred while execu ting this line: Where I should have checked my config. Spent loads of time rebuilding, checking plugins, versioning etc. Why didn’t it work? at ChildProcess.emit (events.js:110:17) Zip file of gradle was not able to download due this restriction. That helped me a lot. Error: cmd: Command failed with exit code 1 C:\ProgramData\Oracle\Java\javapath;C:\Program Files\Common My cordova app then proceeded to build successfully for android. Edit. A pull request just has to be made and reviewed by the original plugin owner. I removed android platforms and install again then worked. clang: error: linker command failed with exit code 1 (use -v to see invocation) in xcode5.1.1 React native iOS build clang: error: linker command failed with exit code 1 (use -v to see invocation) Google login using cordova googleplus plugin I have not found a plugin for Node.js which will do this for Windows. Hi. I was getting 401 error while downloading gradle zip file. * What went wrong: A problem was found with the configuration of task ‘:packageRelease’. Tag: facebook,cordova. iOS Custom UI Quickstart. If you are getting 401 or 403 error in log, make sure you are able to download those files manually. In the project, the file name is repeated and the header file is introduced repeatedly (it may cause duplication when using cocoapods); javascript – How to get relative image coordinate of this div? The problem here is that even though cordova build & cordova run find ANDROID_HOME directory using some heuristics `--list` commands do not. [log ind for at se URL] [log ind for at se URL You'll have to 'remember' which UIViewController calls the object. That’s it! I discovered the root of the problem through the verbose error logging of the build command: Because the naming convention for the plugin was invalid (which was im.ltdev.cordova.UserAgent), Ionic’s build script failed to regenerate the necessary plugins defined on the package.json. Turns out, it was related to a deprecated naming convention for the identifier of the cordova-useragent plugin. Questions: I am trying to connect to an Oracle database from Node.js in Windows 7. Export. Remove from FAQ Add to FAQ. When building without the CometChat plugin, everything works fine. This site uses Akismet to reduce spam. Write to us and get your app developed starting from $199 Posted by Gaetan Vialon 2 years ago (edited) add tag. After adding the plugin back, it should add the plugin to your plugins folder, and in turn, your android project. Msbuild error: the command exited with code 255 due to post build event command Is 1gb ram enough for visual studio 2013 Command failed with exit code 1 File:MDAVSCLI You can follow my thought process in investigating this issue. Files (x86)\ATI Technologies\ATI.ACE\Core-Static;C:\Program Files Hello community, Since a week I can’t deploy new version of our app. (x86)\QuickTime\QTSystem\;C:\Program Files ERROR building one of the platforms: Error: cmd: Command failed with C:\android\sdk\tools\ant\build.xml:734: Compile failed; see the throw e; Why? I'm trying to compile a mex file on MAC OS X 10.13.4 using MATLAB 2015b and Xcode 9.3. jquery – Scroll child div edge to parent div edge, javascript – Problem in getting a return value from an ajax script, Combining two form values in a loop using jquery, jquery – Get id of element in Isotope filtered items, javascript – How can I get the background image URL in Jquery and then replace the non URL parts of the string, jquery – Angular 8 click is working as javascript onload function. Android Custom UI Quickstart. Re-running this command with the --verbose flag may provide more information. To summarize the possible reasons: 1. This could be your problem, I also have 3 versions of each app. Dynamic Methods Professional Team Blog Have an Idea to develop an App ? Then I hit a second problem – with this message in the build output: FAILURE: Build failed with an exception. Cordova build: Command failed with exit code 8. I installed Android 7.0.0, created AVD, tried to connect real device. Can you try removing them and see if you can build with 5.1.1. cordova build android --verbose exited with exit code 1. Files\nodejs\;C:\Program Files (x86)\Git\bin;C:\Program Files I work with Win 10 and this it's a build failed to iOS application file I have update a Intel XDK to build 3240, so I have converted my previous App to Android build and I have update all plugins. C:\hascevher\platforms\android\cordova\node_modules\q\q.js:126 Files\Microsoft Shared\Windows Live;C:\Program Files (x86)\Common (x86)\Java\jdk1.7.0_75\bin;C:\cordova\apache-ant-1.9.4\bin;C:\android\sdk\tools;C:\android\sdk\platform-tools;C:\Program Reading build config file: \build.json… SyntaxError: Unexpected token, The solution for that was to remove the bom from the build.json file. First Stop Next Time! Update the legacy Openremote integration to the ICT Protege system. I use my cordova app to build 2 seperate apps that share majority of the same codebase and it drives off the config.xml. I’m using Visual Studio 2015, and I’ve found that the first thing to do is look in the build output. exit code 1, You may not have the required environment or OS to build this project Your email address will not be published. dova\node_modules\cordova-lib\src\cordova\superspawn.js:134:23) at maybeClose (child_process.js:1015:16) November 23, 2017 You have a couple of choices; a) edit the accepted result/exit/return codes list, so that ConfigMgr regards "1" the same as "0" and "3010" We should fix this to work. Pastebin.com is the number one paste tool since 2002. NativeScript Overview. You may not have the required environment or OS to build this project Error: cmd: Command failed with exit code 1 at ChildProcess.whenDone (C:\Users\Hddn\AppData\Roaming\npm\node_modules\cor dova\node_modules\cordova-lib\src\cordova\superspawn.js:134:23) Faced same problem. When executing the command 12e15a41-c844-6af2-ae2a-40654a7f133d reported Oct 26 at 05:23 AM . There’s two ways to go about addressing the issue. Questions: I’m programming an apartment & house rental site. Leave a comment. If you can, then one of the plugins that you removed is the issue. When i try to create a new helloworld cordova project and adding android platform then from cmd cordova build android it creates sample app? Your email address will not be published. Probably, "exit code 1" means "success" for this particular utility "netcfg"? ^ Error code 1 for command: cmd with args: /s,/c,ant,release,-f,C:\hascevher\platf i got error when try run "d:\myapp\app>ionic build android" command.upto processes work .can 1 tell me proper solution that.thanks in advance.

Kew Gardens 50p 2009, Jaden Ivey Age, Blind Ambition Movie, Automated Day Trading Reddit, Bayview Beachfront Apartments, Dreaming City Lost Sectors Map, Hypocrite Person Meaning In Urdu, Family Guy Kill Count,

Share this post

Leave a Reply